{"text_format":"1","workbook":"xlsx","n_sheets":4,"sheets":["Wedstrijdoverzicht","Uitleg","Inschrijftabel ZP Sprint 2017","Inschrijfpagina"],"not_rendered":{"charts":0,"images":7,"macros":1,"external_links":0,"defined_names":0,"comments":0,"pivot_tables":0},"unopened":[],"bounds":{"document_bytes":16777216,"sheet_cells":100000,"rows_first":2000,"rows_last":500,"rows_between":2000,"halvings":0,"cell_chars":16384,"cell_head_chars":4096},"cells_cut":0,"cells_raw":0,"read":"whole","date_system":"1900"}

{"sheet":"Wedstrijdoverzicht","index":0,"n_rows":127,"n_cols":8,"rows_kept":127,"cut":false,"hidden":true,"merged":[]}
["Inschrijfnummer","Boot","Klasse","Afstand",null,null,"KV Argonauten","ARG"]
[111,"MK1","Dames Pupillen ","100 m",null,null,"EKV Beatrix","BEA"]
[112,"KII","Dames Pupillen ","100 m",null,null,"Deventer Kano vereniging","DKV"]
[113,"KIV","Dames Pupillen ","100 m",null,null,"KV Frisia","FRI"]
[121,"KI","Dames Aspiranten B","100 m",null,null,"KV De Geuzen","GEU"]
[122,"KII","Dames Aspiranten B","100 m",null,null,"Groninger Kanovereniging","GKV"]
[123,"KIV","Dames Aspiranten B","100 m",null,null,"KV Gaasperplas","GP"]
[131,"KI","Dames Aspiranten A","100 m",null,null,"KV Hardenberg","KVH"]
[132,"KII","Dames Aspiranten A","100 m",null,null,"KV Skonevaarder","SK"]
[133,"KIV","Dames Aspiranten A","100 m",null,null,"KC Tilburg","KCT"]
[141,"KI","Dames Junioren B","100 m",null,null,"Twentse Watersport Vereniging","TWV"]
[142,"KII","Dames Junioren B","100 m",null,null,"KV Viking Amsterdam","VIK"]
[143,"KIV","Dames Junioren B","100 m",null,null,"De Zwetplassers","ZP"]
[151,"KI","Dames Junioren A","100 m",null,null,"TKC Lijnbeesten","TKC"]
[152,"KII","Dames Junioren A","100 m"]
[153,"KIV","Dames Junioren A","100 m"]
[161,"KI","Dames Senioren ","100 m"]
[162,"KII","Dames Senioren ","100 m"]
[163,"KIV","Dames Senioren ","100 m"]
[181,"KI","Dames Veteranen","100 m"]
[182,"KII","Dames Veteranen","100 m"]
[183,"KIV","Dames Veteranen","100 m"]
[211,"MK1","Dames Pupillen ","200 m"]
[212,"KII","Dames Pupillen ","200 m"]
[213,"KIV","Dames Pupillen ","200 m"]
[221,"KI","Dames Aspiranten B","200 m"]
[222,"KII","Dames Aspiranten B","200 m"]
[223,"KIV","Dames Aspiranten B","200 m"]
[231,"KI","Dames Aspiranten A","200 m"]
[232,"KII","Dames Aspiranten A","200 m"]
[233,"KIV","Dames Aspiranten A","200 m"]
[241,"KI","Dames Junioren B","200 m"]
[242,"KII","Dames Junioren B","200 m"]
[243,"KIV","Dames Junioren B","200 m"]
[251,"KI","Dames Junioren A","200 m"]
[252,"KII","Dames Junioren A","200 m"]
[253,"KIV","Dames Junioren A","200 m"]
[261,"KI","Dames Senioren ","200 m"]
[262,"KII","Dames Senioren ","200 m"]
[263,"KIV","Dames Senioren ","200 m"]
{"$rows_left_out":88}
{"sheet":"Uitleg","index":1,"n_rows":21,"n_cols":17,"rows_kept":21,"cut":false,"hidden":false,"merged":[[20,1,26,11],[0,1,0,9],[1,1,1,9],[1,10,1,13],[17,3,17,4],[12,5,12,7],[12,8,12,10],[12,11,12,16],[3,4,3,8],[5,4,5,8],[6,4,6,8],[8,4,8,8],[9,4,9,8],[7,4,7,6]]}
[null,"Inschrijfformulier ZP Sprint"]
[null,"2017-05-27",null,null,null,null,null,null,null,null,"Afkortingen voor verenigingen:"]
[]
[null,null,null,"Vereniging:","Klik op de pijl rechts in deze cel en zoek jouw vereniging in de lijst",null,null,null,null,null,"KV Argonauten","ARG","KV Hardenberg","KVH"]
[null,"Contactpersoon inschrijvingen",null,null,null,null,null,null,null,null,"EKV Beatrix","BEA","KV Skonevaarder","SK"]
[null,null,null,"Naam:","Met wie kunnen we contact opnemen over de inschrijvingen?",null,null,null,null,null,"Deventer Kano vereniging","DKV","KC Tilburg","KCT"]
[null,null,null,"E-mail adres:",null,null,null,null,null,null,"KV Frisia","FRI","Twentse Watersport Vereniging","TWV"]
[null,"Wedstrijdleider:",null,null,null,null,null,null,null,null,"KV De Geuzen","GEU","KV Viking Amsterdam","VIK"]
[null,null,null,"Naam:","Wie zal tijdens de wedstrijden de wedstrijdleider zijn?",null,null,null,null,null,"Groninger Kanovereniging","GKV","De Zwetplassers","ZP"]
[null,null,null,"E-mail adres:",null,null,null,null,null,null,"KV Gaasperplas","GP","TKC Lijnbeesten","TKC"]
[]
[]
[null,null,null,null,null,"KI en MKI",null,null,"KII",null,null,"KIV"]
[null,"Inschrijfnr.","Boot","Klasse","Afstand","Voornaam","Achternaam","Vereniging","Voornaam","Achternaam","Vereniging","Voornaam","Achternaam","Vereniging","Voornaam","Achternaam","Vereniging"]
[null,124,{"$f":"VLOOKUP(B15,Wedstrijdoverzicht!A:B,2,FALSE)","v":"KI"},{"$f":"IF(B15>0,IFERROR(VLOOKUP(B15,Wedstrijdoverzicht!A:C,3,FALSE),\"Ongeldig inschrijfnummer!\"),\"\")","v":"Heren Aspiranten B"},{"$f":"VLOOKUP(B15,Wedstrijdoverzicht!A:D,4,FALSE)","v":"100 m"}]
[null,125,{"$f":"VLOOKUP(B16,Wedstrijdoverzicht!A:B,2,FALSE)","v":"KII"},{"$f":"IF(B16>0,IFERROR(VLOOKUP(B16,Wedstrijdoverzicht!A:C,3,FALSE),\"Ongeldig inschrijfnummer!\"),\"\")","v":"Heren Aspiranten B"},{"$f":"VLOOKUP(B16,Wedstrijdoverzicht!A:D,4,FALSE)","v":"100 m"}]
[null,126,{"$f":"VLOOKUP(B17,Wedstrijdoverzicht!A:B,2,FALSE)","v":"KIV"},{"$f":"IF(B17>0,IFERROR(VLOOKUP(B17,Wedstrijdoverzicht!A:C,3,FALSE),\"Ongeldig inschrijfnummer!\"),\"\")","v":"Heren Aspiranten B"},{"$f":"VLOOKUP(B17,Wedstrijdoverzicht!A:D,4,FALSE)","v":"100 m"}]
[null,1111,{"$f":"VLOOKUP(B18,Wedstrijdoverzicht!A:B,2,FALSE)","v":{"$error":"#N/A"}},{"$f":"IF(B18>0,IFERROR(VLOOKUP(B18,Wedstrijdoverzicht!A:C,3,FALSE),\"Ongeldig inschrijfnummer!\"),\"\")","v":"Ongeldig inschrijfnummer!"}]
[null,null,{"$f":"VLOOKUP(B19,Wedstrijdoverzicht!A:B,2,FALSE)","v":{"$error":"#N/A"}},{"$f":"IF(B19>0,IFERROR(VLOOKUP(B19,Wedstrijdoverzicht!A:C,3,FALSE),\"Ongeldig inschrijfnummer!\"),\"\")","v":""},{"$f":"VLOOKUP(B19,Wedstrijdoverzicht!A:D,4,FALSE)","v":{"$error":"#N/A"}}]
[]
[null,"Op het tabblad \"Inschrijftabel ZP Sprint 2017\" vind je een overzicht van alle wedstrijden, zoek daaruit de inschrijfnummers en vul die hier in kolom B in. De informatie over de boot, klasse en afstand wordt automatisch ingevuld zodat je nog kunt checken of je wel de juiste wedstrijd hebt geselecteerd. Geef je een inschrijfnummer op dat niet bestaat dan krijg je hier een melding van. Vervolgens dien je de voor- en achternaam van de sporter in te vullen. Als je je inschrijft voor een KI wedstrijd hoef je je vereniging niet in te vullen. Maar wil je een KII of KIV wedstrijd invullen dan kun je uit de lijst die in de cel staat de juiste vereniging zoeken aangezien het niet vanzelfsprekend is dat deze tweede, derde en vierde kanoër van dezelfde vereniging is!                                                                      Alle velden die ingevuld moeten worden zijn blauw, zoals hierboven ook in het voorbeeld te zien is bij de KI, KII en KIV wedstrijd. Het heeft de voorkeur direct volle meerpersoonsboten in te schrijven, maar dit is niet verplicht!"]

{"sheet":"Inschrijftabel ZP Sprint 2017","index":2,"n_rows":66,"n_cols":10,"rows_kept":66,"cut":false,"hidden":false,"merged":[[1,2,1,5],[1,6,1,9],[3,1,23,1],[24,1,44,1],[45,1,65,1]]}
[]
[null,null,"Heren",null,null,null,"Dames"]
[null,null,"Inschrijfnummer","Boot","Klasse","Afstand","Inschrijfnummer","Boot","Klasse","Afstand"]
[null,"100 meter ",114,"MK1","Heren Pupillen ","100 m",111,"MK1","Dames Pupillen ","100 m"]
[null,null,115,"KII","Heren Pupillen ","100 m",112,"KII","Dames Pupillen ","100 m"]
[null,null,116,"KIV","Heren Pupillen ","100 m",113,"KIV","Dames Pupillen ","100 m"]
[null,null,124,"KI","Heren Aspiranten B","100 m",121,"KI","Dames Aspiranten B","100 m"]
[null,null,125,"KII","Heren Aspiranten B","100 m",122,"KII","Dames Aspiranten B","100 m"]
[null,null,126,"KIV","Heren Aspiranten B","100 m",123,"KIV","Dames Aspiranten B","100 m"]
[null,null,134,"KI","Heren Aspiranten A","100 m",131,"KI","Dames Aspiranten A","100 m"]
[null,null,135,"KII","Heren Aspiranten A","100 m",132,"KII","Dames Aspiranten A","100 m"]
[null,null,136,"KIV","Heren Aspiranten A","100 m",133,"KIV","Dames Aspiranten A","100 m"]
[null,null,144,"KI","Heren Junioren B","100 m",141,"KI","Dames Junioren B","100 m"]
[null,null,145,"KII","Heren Junioren B","100 m",142,"KII","Dames Junioren B","100 m"]
[null,null,146,"KIV","Heren Junioren B","100 m",143,"KIV","Dames Junioren B","100 m"]
[null,null,154,"KI","Heren Junioren A","100 m",151,"KI","Dames Junioren A","100 m"]
[null,null,155,"KII","Heren Junioren A","100 m",152,"KII","Dames Junioren A","100 m"]
[null,null,156,"KIV","Heren Junioren A","100 m",153,"KIV","Dames Junioren A","100 m"]
[null,null,164,"KI","Heren Senioren ","100 m",161,"KI","Dames Senioren ","100 m"]
[null,null,165,"KII","Heren Senioren ","100 m",162,"KII","Dames Senioren ","100 m"]
[null,null,166,"KIV","Heren Senioren ","100 m",163,"KIV","Dames Senioren ","100 m"]
[null,null,184,"KI","Heren Veteranen","100 m",181,"KI","Dames Veteranen","100 m"]
[null,null,185,"KII","Heren Veteranen","100 m",182,"KII","Dames Veteranen","100 m"]
[null,null,186,"KIV","Heren Veteranen","100 m",183,"KIV","Dames Veteranen","100 m"]
[null,"200 meter ",214,"MK1","Heren Pupillen ","200 m",211,"MK1","Dames Pupillen ","200 m"]
[null,null,215,"KII","Heren Pupillen ","200 m",212,"KII","Dames Pupillen ","200 m"]
[null,null,216,"KIV","Heren Pupillen ","200 m",213,"KIV","Dames Pupillen ","200 m"]
[null,null,224,"KI","Heren Aspiranten B","200 m",221,"KI","Dames Aspiranten B","200 m"]
[null,null,225,"KII","Heren Aspiranten B","200 m",222,"KII","Dames Aspiranten B","200 m"]
[null,null,226,"KIV","Heren Aspiranten B","200 m",223,"KIV","Dames Aspiranten B","200 m"]
[null,null,234,"KI","Heren Aspiranten A","200 m",231,"KI","Dames Aspiranten A","200 m"]
[null,null,235,"KII","Heren Aspiranten A","200 m",232,"KII","Dames Aspiranten A","200 m"]
[null,null,236,"KIV","Heren Aspiranten A","200 m",233,"KIV","Dames Aspiranten A","200 m"]
[null,null,244,"KI","Heren Junioren B","200 m",241,"KI","Dames Junioren B","200 m"]
[null,null,245,"KII","Heren Junioren B","200 m",242,"KII","Dames Junioren B","200 m"]
[null,null,246,"KIV","Heren Junioren B","200 m",243,"KIV","Dames Junioren B","200 m"]
[null,null,254,"KI","Heren Junioren A","200 m",251,"KI","Dames Junioren A","200 m"]
[null,null,255,"KII","Heren Junioren A","200 m",252,"KII","Dames Junioren A","200 m"]
[null,null,256,"KIV","Heren Junioren A","200 m",253,"KIV","Dames Junioren A","200 m"]
[null,null,264,"KI","Heren Senioren ","200 m",261,"KI","Dames Senioren ","200 m"]
{"$rows_left_out":27}
{"sheet":"Inschrijfpagina","index":3,"n_rows":329,"n_cols":17,"rows_kept":329,"cut":false,"hidden":false,"merged":[[3,4,3,6],[0,1,0,16],[1,1,1,16],[12,5,12,7],[12,8,12,10],[12,11,12,16],[5,4,5,6],[6,4,6,6],[7,4,7,6],[8,4,8,6],[9,4,9,6]]}
[null,"Inschrijfformulier ZP Sprint"]
[null,"2017-05-27"]
[]
[null,null,null,"Vereniging:"]
[null,"Contactpersoon inschrijvingen"]
[null,null,null,"Naam:"]
[null,null,null,"E-mail adres:"]
[null,"Wedstrijdleider:"]
[null,null,null,"Naam:",null,null,null,null,"Wij blijven kamperen en komen met ongeveer:",null,null,null,"tenten"]
[null,null,null,"E-mail adres:",null,null,null,null,null,null,null,null,"caravans"]
[]
[]
[null,null,null,null,null,"KI en MKI",null,null,"KII",null,null,"KIV"]
[null,"Inschrijfnr.","Boot","Klasse","Afstand","Voornaam","Achternaam","Vereniging","Voornaam","Achternaam","Vereniging","Voornaam","Achternaam","Vereniging","Voornaam","Achternaam","Vereniging"]
[null,null,{"$f":"VLOOKUP(B15,Wedstrijdoverzicht!A:B,2,FALSE)","v":{"$error":"#N/A"}},{"$f":"IF(B15>0,IFERROR(VLOOKUP(B15,Wedstrijdoverzicht!A:C,3,FALSE),\"Ongeldig inschrijfnummer!\"),\"\")","v":""},{"$f":"VLOOKUP(B15,Wedstrijdoverzicht!A:D,4,FALSE)","v":{"$error":"#N/A"}},null,null,{"$f":"IF(B15>0,VLOOKUP($E$4,Wedstrijdoverzicht!G:H,2,FALSE),\"\")","v":""}]
[null,null,{"$f":"VLOOKUP(B16,Wedstrijdoverzicht!A:B,2,FALSE)","v":{"$error":"#N/A"}},{"$f":"IF(B16>0,IFERROR(VLOOKUP(B16,Wedstrijdoverzicht!A:C,3,FALSE),\"Ongeldig inschrijfnummer!\"),\"\")","v":""},{"$f":"VLOOKUP(B16,Wedstrijdoverzicht!A:D,4,FALSE)","v":{"$error":"#N/A"}},null,null,{"$f":"IF(B16>0,VLOOKUP($E$4,Wedstrijdoverzicht!G:H,2,FALSE),\"\")","v":""}]
[null,null,{"$f":"VLOOKUP(B17,Wedstrijdoverzicht!A:B,2,FALSE)","v":{"$error":"#N/A"}},{"$f":"IF(B17>0,IFERROR(VLOOKUP(B17,Wedstrijdoverzicht!A:C,3,FALSE),\"Ongeldig inschrijfnummer!\"),\"\")","v":""},{"$f":"VLOOKUP(B17,Wedstrijdoverzicht!A:D,4,FALSE)","v":{"$error":"#N/A"}},null,null,{"$f":"IF(B17>0,VLOOKUP($E$4,Wedstrijdoverzicht!G:H,2,FALSE),\"\")","v":""}]
[null,null,{"$f":"VLOOKUP(B18,Wedstrijdoverzicht!A:B,2,FALSE)","v":{"$error":"#N/A"}},{"$f":"IF(B18>0,IFERROR(VLOOKUP(B18,Wedstrijdoverzicht!A:C,3,FALSE),\"Ongeldig inschrijfnummer!\"),\"\")","v":""},{"$f":"VLOOKUP(B18,Wedstrijdoverzicht!A:D,4,FALSE)","v":{"$error":"#N/A"}},null,null,{"$f":"IF(B18>0,VLOOKUP($E$4,Wedstrijdoverzicht!G:H,2,FALSE),\"\")","v":""}]
[null,null,{"$f":"VLOOKUP(B19,Wedstrijdoverzicht!A:B,2,FALSE)","v":{"$error":"#N/A"}},{"$f":"IF(B19>0,IFERROR(VLOOKUP(B19,Wedstrijdoverzicht!A:C,3,FALSE),\"Ongeldig inschrijfnummer!\"),\"\")","v":""},{"$f":"VLOOKUP(B19,Wedstrijdoverzicht!A:D,4,FALSE)","v":{"$error":"#N/A"}},null,null,{"$f":"IF(B19>0,VLOOKUP($E$4,Wedstrijdoverzicht!G:H,2,FALSE),\"\")","v":""}]
[null,null,{"$f":"VLOOKUP(B20,Wedstrijdoverzicht!A:B,2,FALSE)","v":{"$error":"#N/A"}},{"$f":"IF(B20>0,IFERROR(VLOOKUP(B20,Wedstrijdoverzicht!A:C,3,FALSE),\"Ongeldig inschrijfnummer!\"),\"\")","v":""},{"$f":"VLOOKUP(B20,Wedstrijdoverzicht!A:D,4,FALSE)","v":{"$error":"#N/A"}},null,null,{"$f":"IF(B20>0,VLOOKUP($E$4,Wedstrijdoverzicht!G:H,2,FALSE),\"\")","v":""}]
[null,null,{"$f":"VLOOKUP(B21,Wedstrijdoverzicht!A:B,2,FALSE)","v":{"$error":"#N/A"}},{"$f":"IF(B21>0,IFERROR(VLOOKUP(B21,Wedstrijdoverzicht!A:C,3,FALSE),\"Ongeldig inschrijfnummer!\"),\"\")","v":""},{"$f":"VLOOKUP(B21,Wedstrijdoverzicht!A:D,4,FALSE)","v":{"$error":"#N/A"}},null,null,{"$f":"IF(B21>0,VLOOKUP($E$4,Wedstrijdoverzicht!G:H,2,FALSE),\"\")","v":""}]
[null,null,{"$f":"VLOOKUP(B22,Wedstrijdoverzicht!A:B,2,FALSE)","v":{"$error":"#N/A"}},{"$f":"IF(B22>0,IFERROR(VLOOKUP(B22,Wedstrijdoverzicht!A:C,3,FALSE),\"Ongeldig inschrijfnummer!\"),\"\")","v":""},{"$f":"VLOOKUP(B22,Wedstrijdoverzicht!A:D,4,FALSE)","v":{"$error":"#N/A"}},null,null,{"$f":"IF(B22>0,VLOOKUP($E$4,Wedstrijdoverzicht!G:H,2,FALSE),\"\")","v":""}]
[null,null,{"$f":"VLOOKUP(B23,Wedstrijdoverzicht!A:B,2,FALSE)","v":{"$error":"#N/A"}},{"$f":"IF(B23>0,IFERROR(VLOOKUP(B23,Wedstrijdoverzicht!A:C,3,FALSE),\"Ongeldig inschrijfnummer!\"),\"\")","v":""},{"$f":"VLOOKUP(B23,Wedstrijdoverzicht!A:D,4,FALSE)","v":{"$error":"#N/A"}},null,null,{"$f":"IF(B23>0,VLOOKUP($E$4,Wedstrijdoverzicht!G:H,2,FALSE),\"\")","v":""}]
[null,null,{"$f":"VLOOKUP(B24,Wedstrijdoverzicht!A:B,2,FALSE)","v":{"$error":"#N/A"}},{"$f":"IF(B24>0,IFERROR(VLOOKUP(B24,Wedstrijdoverzicht!A:C,3,FALSE),\"Ongeldig inschrijfnummer!\"),\"\")","v":""},{"$f":"VLOOKUP(B24,Wedstrijdoverzicht!A:D,4,FALSE)","v":{"$error":"#N/A"}},null,null,{"$f":"IF(B24>0,VLOOKUP($E$4,Wedstrijdoverzicht!G:H,2,FALSE),\"\")","v":""}]
[null,null,{"$f":"VLOOKUP(B25,Wedstrijdoverzicht!A:B,2,FALSE)","v":{"$error":"#N/A"}},{"$f":"IF(B25>0,IFERROR(VLOOKUP(B25,Wedstrijdoverzicht!A:C,3,FALSE),\"Ongeldig inschrijfnummer!\"),\"\")","v":""},{"$f":"VLOOKUP(B25,Wedstrijdoverzicht!A:D,4,FALSE)","v":{"$error":"#N/A"}},null,null,{"$f":"IF(B25>0,VLOOKUP($E$4,Wedstrijdoverzicht!G:H,2,FALSE),\"\")","v":""}]
[null,null,{"$f":"VLOOKUP(B26,Wedstrijdoverzicht!A:B,2,FALSE)","v":{"$error":"#N/A"}},{"$f":"IF(B26>0,IFERROR(VLOOKUP(B26,Wedstrijdoverzicht!A:C,3,FALSE),\"Ongeldig inschrijfnummer!\"),\"\")","v":""},{"$f":"VLOOKUP(B26,Wedstrijdoverzicht!A:D,4,FALSE)","v":{"$error":"#N/A"}},null,null,{"$f":"IF(B26>0,VLOOKUP($E$4,Wedstrijdoverzicht!G:H,2,FALSE),\"\")","v":""}]
[null,null,{"$f":"VLOOKUP(B27,Wedstrijdoverzicht!A:B,2,FALSE)","v":{"$error":"#N/A"}},{"$f":"IF(B27>0,IFERROR(VLOOKUP(B27,Wedstrijdoverzicht!A:C,3,FALSE),\"Ongeldig inschrijfnummer!\"),\"\")","v":""},{"$f":"VLOOKUP(B27,Wedstrijdoverzicht!A:D,4,FALSE)","v":{"$error":"#N/A"}},null,null,{"$f":"IF(B27>0,VLOOKUP($E$4,Wedstrijdoverzicht!G:H,2,FALSE),\"\")","v":""}]
[null,null,{"$f":"VLOOKUP(B28,Wedstrijdoverzicht!A:B,2,FALSE)","v":{"$error":"#N/A"}},{"$f":"IF(B28>0,IFERROR(VLOOKUP(B28,Wedstrijdoverzicht!A:C,3,FALSE),\"Ongeldig inschrijfnummer!\"),\"\")","v":""},{"$f":"VLOOKUP(B28,Wedstrijdoverzicht!A:D,4,FALSE)","v":{"$error":"#N/A"}},null,null,{"$f":"IF(B28>0,VLOOKUP($E$4,Wedstrijdoverzicht!G:H,2,FALSE),\"\")","v":""}]
[null,null,{"$f":"VLOOKUP(B29,Wedstrijdoverzicht!A:B,2,FALSE)","v":{"$error":"#N/A"}},{"$f":"IF(B29>0,IFERROR(VLOOKUP(B29,Wedstrijdoverzicht!A:C,3,FALSE),\"Ongeldig inschrijfnummer!\"),\"\")","v":""},{"$f":"VLOOKUP(B29,Wedstrijdoverzicht!A:D,4,FALSE)","v":{"$error":"#N/A"}},null,null,{"$f":"IF(B29>0,VLOOKUP($E$4,Wedstrijdoverzicht!G:H,2,FALSE),\"\")","v":""}]
[null,null,{"$f":"VLOOKUP(B30,Wedstrijdoverzicht!A:B,2,FALSE)","v":{"$error":"#N/A"}},{"$f":"IF(B30>0,IFERROR(VLOOKUP(B30,Wedstrijdoverzicht!A:C,3,FALSE),\"Ongeldig inschrijfnummer!\"),\"\")","v":""},{"$f":"VLOOKUP(B30,Wedstrijdoverzicht!A:D,4,FALSE)","v":{"$error":"#N/A"}},null,null,{"$f":"IF(B30>0,VLOOKUP($E$4,Wedstrijdoverzicht!G:H,2,FALSE),\"\")","v":""}]
[null,null,{"$f":"VLOOKUP(B31,Wedstrijdoverzicht!A:B,2,FALSE)","v":{"$error":"#N/A"}},{"$f":"IF(B31>0,IFERROR(VLOOKUP(B31,Wedstrijdoverzicht!A:C,3,FALSE),\"Ongeldig inschrijfnummer!\"),\"\")","v":""},{"$f":"VLOOKUP(B31,Wedstrijdoverzicht!A:D,4,FALSE)","v":{"$error":"#N/A"}},null,null,{"$f":"IF(B31>0,VLOOKUP($E$4,Wedstrijdoverzicht!G:H,2,FALSE),\"\")","v":""}]
[null,null,{"$f":"VLOOKUP(B32,Wedstrijdoverzicht!A:B,2,FALSE)","v":{"$error":"#N/A"}},{"$f":"IF(B32>0,IFERROR(VLOOKUP(B32,Wedstrijdoverzicht!A:C,3,FALSE),\"Ongeldig inschrijfnummer!\"),\"\")","v":""},{"$f":"VLOOKUP(B32,Wedstrijdoverzicht!A:D,4,FALSE)","v":{"$error":"#N/A"}},null,null,{"$f":"IF(B32>0,VLOOKUP($E$4,Wedstrijdoverzicht!G:H,2,FALSE),\"\")","v":""}]
[null,null,{"$f":"VLOOKUP(B33,Wedstrijdoverzicht!A:B,2,FALSE)","v":{"$error":"#N/A"}},{"$f":"IF(B33>0,IFERROR(VLOOKUP(B33,Wedstrijdoverzicht!A:C,3,FALSE),\"Ongeldig inschrijfnummer!\"),\"\")","v":""},{"$f":"VLOOKUP(B33,Wedstrijdoverzicht!A:D,4,FALSE)","v":{"$error":"#N/A"}},null,null,{"$f":"IF(B33>0,VLOOKUP($E$4,Wedstrijdoverzicht!G:H,2,FALSE),\"\")","v":""}]
[null,null,{"$f":"VLOOKUP(B34,Wedstrijdoverzicht!A:B,2,FALSE)","v":{"$error":"#N/A"}},{"$f":"IF(B34>0,IFERROR(VLOOKUP(B34,Wedstrijdoverzicht!A:C,3,FALSE),\"Ongeldig inschrijfnummer!\"),\"\")","v":""},{"$f":"VLOOKUP(B34,Wedstrijdoverzicht!A:D,4,FALSE)","v":{"$error":"#N/A"}},null,null,{"$f":"IF(B34>0,VLOOKUP($E$4,Wedstrijdoverzicht!G:H,2,FALSE),\"\")","v":""}]
[null,null,{"$f":"VLOOKUP(B35,Wedstrijdoverzicht!A:B,2,FALSE)","v":{"$error":"#N/A"}},{"$f":"IF(B35>0,IFERROR(VLOOKUP(B35,Wedstrijdoverzicht!A:C,3,FALSE),\"Ongeldig inschrijfnummer!\"),\"\")","v":""},{"$f":"VLOOKUP(B35,Wedstrijdoverzicht!A:D,4,FALSE)","v":{"$error":"#N/A"}},null,null,{"$f":"IF(B35>0,VLOOKUP($E$4,Wedstrijdoverzicht!G:H,2,FALSE),\"\")","v":""}]
[null,null,{"$f":"VLOOKUP(B36,Wedstrijdoverzicht!A:B,2,FALSE)","v":{"$error":"#N/A"}},{"$f":"IF(B36>0,IFERROR(VLOOKUP(B36,Wedstrijdoverzicht!A:C,3,FALSE),\"Ongeldig inschrijfnummer!\"),\"\")","v":""},{"$f":"VLOOKUP(B36,Wedstrijdoverzicht!A:D,4,FALSE)","v":{"$error":"#N/A"}},null,null,{"$f":"IF(B36>0,VLOOKUP($E$4,Wedstrijdoverzicht!G:H,2,FALSE),\"\")","v":""}]
[null,null,{"$f":"VLOOKUP(B37,Wedstrijdoverzicht!A:B,2,FALSE)","v":{"$error":"#N/A"}},{"$f":"IF(B37>0,IFERROR(VLOOKUP(B37,Wedstrijdoverzicht!A:C,3,FALSE),\"Ongeldig inschrijfnummer!\"),\"\")","v":""},{"$f":"VLOOKUP(B37,Wedstrijdoverzicht!A:D,4,FALSE)","v":{"$error":"#N/A"}},null,null,{"$f":"IF(B37>0,VLOOKUP($E$4,Wedstrijdoverzicht!G:H,2,FALSE),\"\")","v":""}]
[null,null,{"$f":"VLOOKUP(B38,Wedstrijdoverzicht!A:B,2,FALSE)","v":{"$error":"#N/A"}},{"$f":"IF(B38>0,IFERROR(VLOOKUP(B38,Wedstrijdoverzicht!A:C,3,FALSE),\"Ongeldig inschrijfnummer!\"),\"\")","v":""},{"$f":"VLOOKUP(B38,Wedstrijdoverzicht!A:D,4,FALSE)","v":{"$error":"#N/A"}},null,null,{"$f":"IF(B38>0,VLOOKUP($E$4,Wedstrijdoverzicht!G:H,2,FALSE),\"\")","v":""}]
[null,null,{"$f":"VLOOKUP(B39,Wedstrijdoverzicht!A:B,2,FALSE)","v":{"$error":"#N/A"}},{"$f":"IF(B39>0,IFERROR(VLOOKUP(B39,Wedstrijdoverzicht!A:C,3,FALSE),\"Ongeldig inschrijfnummer!\"),\"\")","v":""},{"$f":"VLOOKUP(B39,Wedstrijdoverzicht!A:D,4,FALSE)","v":{"$error":"#N/A"}},null,null,{"$f":"IF(B39>0,VLOOKUP($E$4,Wedstrijdoverzicht!G:H,2,FALSE),\"\")","v":""}]
[null,null,{"$f":"VLOOKUP(B40,Wedstrijdoverzicht!A:B,2,FALSE)","v":{"$error":"#N/A"}},{"$f":"IF(B40>0,IFERROR(VLOOKUP(B40,Wedstrijdoverzicht!A:C,3,FALSE),\"Ongeldig inschrijfnummer!\"),\"\")","v":""},{"$f":"VLOOKUP(B40,Wedstrijdoverzicht!A:D,4,FALSE)","v":{"$error":"#N/A"}},null,null,{"$f":"IF(B40>0,VLOOKUP($E$4,Wedstrijdoverzicht!G:H,2,FALSE),\"\")","v":""}]
{"$rows_left_out":289}